Information card for entry 4346173
Formula | C39 H48 Co N2 O4 |
Calculated formula | C39 H48 Co N2 O4 |
Title of publication | Lattice-Modulated Phase Transition Coupled with Redox-Isomeric Interconversion of o-Semiquinone-Catecholato into Bis(o-semiquinonato) Cobalt Complexes. |
Authors of publication | Bubnov, Michael P.; Skorodumova, Nina A.; Arapova, Alla V.; Smirnova, Natalia N.; Samsonov, Maxim A.; Fukin, Georgy K.; Cherkasov, Vladimir K.; Abakumov, Gleb A. |
Journal of publication | Inorganic chemistry |
Year of publication | 2015 |
Journal volume | 54 |
Journal issue | 16 |
Pages of publication | 7767 - 7773 |
a | 10.64542 ± 0.00012 Å |
b | 29.8999 ± 0.0003 Å |
c | 12.07078 ± 0.00016 Å |
α | 90° |
β | 112.506 ± 0.0015° |
γ | 90° |
Cell volume | 3549.47 ± 0.08 Å3 |
Cell temperature | 100 ± 2 K |
Ambient diffraction temperature | 100 ± 2 K |
Number of distinct elements | 5 |
Space group number | 15 |
Hermann-Mauguin space group symbol | C 1 2/c 1 |
Hall space group symbol | -C 2yc |
Residual factor for all reflections | 0.033 |
Residual factor for significantly intense reflections | 0.0302 |
Weighted residual factors for significantly intense reflections | 0.0815 |
Weighted residual factors for all reflections included in the refinement | 0.0836 |
Goodness-of-fit parameter for all reflections included in the refinement | 1.037 |
Diffraction radiation wavelength | 0.71073 Å |
Diffraction radiation type | MoKα |