Information card for entry 4346199
Formula | C57 H34 B2 F42 N8 Zn |
Calculated formula | C57 H34 B2 F42 N8 Zn |
Title of publication | Zinc-Mediated Carbene Insertion to C-Cl Bonds of Chloromethanes and Isolable Zinc(II) Isocyanide Adducts. |
Authors of publication | Kulkarni, Naveen V.; Das, Animesh; Jayaratna, Naleen B.; Yousufuddin, Muhammed; Dias, H. V. Rasika |
Journal of publication | Inorganic chemistry |
Year of publication | 2015 |
Journal volume | 54 |
Journal issue | 11 |
Pages of publication | 5151 - 5153 |
a | 17.9929 ± 0.0015 Å |
b | 17.0158 ± 0.0014 Å |
c | 23.9 ± 0.002 Å |
α | 90° |
β | 109.678 ± 0.0017° |
γ | 90° |
Cell volume | 6890 ± 1 Å3 |
Cell temperature | 130 ± 2 K |
Ambient diffraction temperature | 130.01 K |
Number of distinct elements | 6 |
Space group number | 14 |
Hermann-Mauguin space group symbol | P 1 21/c 1 |
Hall space group symbol | -P 2ybc |
Residual factor for all reflections | 0.1435 |
Residual factor for significantly intense reflections | 0.0771 |
Weighted residual factors for significantly intense reflections | 0.2019 |
Weighted residual factors for all reflections included in the refinement | 0.2509 |
Goodness-of-fit parameter for all reflections included in the refinement | 1.026 |
Diffraction radiation wavelength | 0.71073 Å |
Diffraction radiation type | MoKα |