Information card for entry 4346203
Chemical name | Mn2(bipym)V4O12 |
Formula | C4 H3.61 Mn N2 O6.31 V2 |
Calculated formula | C4 H3.612 Mn N2 O6.305 V2 |
Title of publication | Manganese-Vanadate Hybrids: Impact of Organic Ligands on Their Structures, Thermal Stabilities, Optical Properties, and Photocatalytic Activities. |
Authors of publication | Luo, Lan; Zeng, Yuhan; Li, Le; Luo, Zhixiang; Smirnova, Tatyana I.; Maggard, Paul A. |
Journal of publication | Inorganic chemistry |
Year of publication | 2015 |
Journal volume | 54 |
Journal issue | 15 |
Pages of publication | 7388 - 7401 |
a | 8.349 ± 0.0004 Å |
b | 18.9527 ± 0.001 Å |
c | 5.9129 ± 0.0003 Å |
α | 90° |
β | 95.581 ± 0.003° |
γ | 90° |
Cell volume | 931.2 ± 0.08 Å3 |
Cell temperature | 110 ± 2 K |
Ambient diffraction temperature | 110.15 K |
Number of distinct elements | 6 |
Space group number | 12 |
Hermann-Mauguin space group symbol | C 1 2/m 1 |
Hall space group symbol | -C 2y |
Residual factor for all reflections | 0.0513 |
Residual factor for significantly intense reflections | 0.0332 |
Weighted residual factors for significantly intense reflections | 0.0685 |
Weighted residual factors for all reflections included in the refinement | 0.0737 |
Goodness-of-fit parameter for all reflections included in the refinement | 1.086 |
Diffraction radiation wavelength | 0.71073 Å |
Diffraction radiation type | MoKα |