Information card for entry 4346204
Formula | C15 H13 Mn N3 O7 V2 |
Calculated formula | C15 H13 Mn N3 O7 V2 |
Title of publication | Manganese-Vanadate Hybrids: Impact of Organic Ligands on Their Structures, Thermal Stabilities, Optical Properties, and Photocatalytic Activities. |
Authors of publication | Luo, Lan; Zeng, Yuhan; Li, Le; Luo, Zhixiang; Smirnova, Tatyana I.; Maggard, Paul A. |
Journal of publication | Inorganic chemistry |
Year of publication | 2015 |
Journal volume | 54 |
Journal issue | 15 |
Pages of publication | 7388 - 7401 |
a | 6.9073 ± 0.0012 Å |
b | 11.211 ± 0.0019 Å |
c | 13.094 ± 0.003 Å |
α | 106.749 ± 0.014° |
β | 102.05 ± 0.014° |
γ | 106.448 ± 0.01° |
Cell volume | 883.5 ± 0.3 Å3 |
Cell temperature | 110 ± 2 K |
Ambient diffraction temperature | 110.15 K |
Number of distinct elements | 6 |
Space group number | 2 |
Hermann-Mauguin space group symbol | P -1 |
Hall space group symbol | -P 1 |
Residual factor for all reflections | 0.0492 |
Residual factor for significantly intense reflections | 0.0388 |
Weighted residual factors for significantly intense reflections | 0.0971 |
Weighted residual factors for all reflections included in the refinement | 0.1022 |
Goodness-of-fit parameter for all reflections included in the refinement | 1.049 |
Diffraction radiation wavelength | 0.71073 Å |
Diffraction radiation type | MoKα |