Information card for entry 4346206
Formula | C55 H71 N3 O3 Ti3 |
Calculated formula | C55 H71 N3 O3 Ti3 |
Title of publication | Carbon-nitrogen bond construction and carbon-oxygen double bond cleavage on a molecular titanium oxonitride: a combined experimental and computational study. |
Authors of publication | Carbó, Jorge J; García-López, Diego; González-Del Moral, Octavio; Martín, Avelino; Mena, Miguel; Santamaría, Cristina |
Journal of publication | Inorganic chemistry |
Year of publication | 2015 |
Journal volume | 54 |
Journal issue | 19 |
Pages of publication | 9401 - 9412 |
a | 12.198 ± 0.002 Å |
b | 12.518 ± 0.003 Å |
c | 17.154 ± 0.003 Å |
α | 94.036 ± 0.017° |
β | 94.281 ± 0.017° |
γ | 104.016 ± 0.012° |
Cell volume | 2523.6 ± 0.9 Å3 |
Cell temperature | 200 ± 2 K |
Ambient diffraction temperature | 200 ± 2 K |
Number of distinct elements | 5 |
Space group number | 2 |
Hermann-Mauguin space group symbol | P -1 |
Hall space group symbol | -P 1 |
Residual factor for all reflections | 0.0852 |
Residual factor for significantly intense reflections | 0.0467 |
Weighted residual factors for significantly intense reflections | 0.1078 |
Weighted residual factors for all reflections included in the refinement | 0.1303 |
Goodness-of-fit parameter for all reflections included in the refinement | 1.093 |
Diffraction radiation probe | x-ray |
Diffraction radiation wavelength | 0.71073 Å |
Diffraction radiation type | MoKα |