Information card for entry 4346207
Formula | C86 H124 N6 O6 Ti6 |
Calculated formula | C86 H124 N6 O6 Ti6 |
Title of publication | Carbon-nitrogen bond construction and carbon-oxygen double bond cleavage on a molecular titanium oxonitride: a combined experimental and computational study. |
Authors of publication | Carbó, Jorge J; García-López, Diego; González-Del Moral, Octavio; Martín, Avelino; Mena, Miguel; Santamaría, Cristina |
Journal of publication | Inorganic chemistry |
Year of publication | 2015 |
Journal volume | 54 |
Journal issue | 19 |
Pages of publication | 9401 - 9412 |
a | 15.883 ± 0.005 Å |
b | 16.313 ± 0.006 Å |
c | 18.762 ± 0.002 Å |
α | 90° |
β | 115.979 ± 0.014° |
γ | 90° |
Cell volume | 4370 ± 2 Å3 |
Cell temperature | 200 ± 2 K |
Ambient diffraction temperature | 200 ± 2 K |
Number of distinct elements | 5 |
Space group number | 14 |
Hermann-Mauguin space group symbol | P 1 21/c 1 |
Hall space group symbol | -P 2ybc |
Residual factor for all reflections | 0.1752 |
Residual factor for significantly intense reflections | 0.0717 |
Weighted residual factors for significantly intense reflections | 0.1383 |
Weighted residual factors for all reflections included in the refinement | 0.1813 |
Goodness-of-fit parameter for all reflections included in the refinement | 0.887 |
Diffraction radiation probe | x-ray |
Diffraction radiation wavelength | 0.71073 Å |
Diffraction radiation type | MoKα |