Information card for entry 4346231
Formula | C43 H92 Mn4 P4 Te4 |
Calculated formula | C43 H92 Mn4 P4 Te4 |
Title of publication | Ligand Control of Manganese Telluride Molecular Cluster Core Nuclearity. |
Authors of publication | Choi, Bonnie; Paley, Daniel W.; Siegrist, Theo; Steigerwald, Michael L.; Roy, Xavier |
Journal of publication | Inorganic chemistry |
Year of publication | 2015 |
Journal volume | 54 |
Journal issue | 17 |
Pages of publication | 8348 - 8355 |
a | 23.6635 ± 0.0003 Å |
b | 10.83596 ± 0.0001 Å |
c | 23.9044 ± 0.0003 Å |
α | 90° |
β | 107.987 ± 0.0012° |
γ | 90° |
Cell volume | 5829.93 ± 0.12 Å3 |
Cell temperature | 100.01 ± 0.1 K |
Ambient diffraction temperature | 100.01 ± 0.1 K |
Number of distinct elements | 5 |
Space group number | 15 |
Hermann-Mauguin space group symbol | C 1 2/c 1 |
Hall space group symbol | -C 2yc |
Residual factor for all reflections | 0.0237 |
Residual factor for significantly intense reflections | 0.0225 |
Weighted residual factors for significantly intense reflections | 0.0542 |
Weighted residual factors for all reflections included in the refinement | 0.055 |
Goodness-of-fit parameter for all reflections included in the refinement | 1.073 |
Diffraction radiation probe | x-ray |
Diffraction radiation wavelength | 1.54184 Å |
Diffraction radiation type | CuKα |