Information card for entry 4346232
Formula | C87 H144 Mn8 N12 Te8 |
Calculated formula | C87 H144 Mn8 N12 Te8 |
Title of publication | Ligand Control of Manganese Telluride Molecular Cluster Core Nuclearity. |
Authors of publication | Choi, Bonnie; Paley, Daniel W.; Siegrist, Theo; Steigerwald, Michael L.; Roy, Xavier |
Journal of publication | Inorganic chemistry |
Year of publication | 2015 |
Journal volume | 54 |
Journal issue | 17 |
Pages of publication | 8348 - 8355 |
a | 14.1776 ± 0.0004 Å |
b | 14.6358 ± 0.0007 Å |
c | 14.9029 ± 0.0008 Å |
α | 61.056 ± 0.005° |
β | 83.162 ± 0.004° |
γ | 87.953 ± 0.003° |
Cell volume | 2686 ± 0.2 Å3 |
Cell temperature | 100 K |
Ambient diffraction temperature | 100 K |
Number of distinct elements | 5 |
Space group number | 2 |
Hermann-Mauguin space group symbol | P -1 |
Hall space group symbol | -P 1 |
Residual factor for all reflections | 0.0624 |
Residual factor for significantly intense reflections | 0.0443 |
Weighted residual factors for significantly intense reflections | 0.1026 |
Weighted residual factors for all reflections included in the refinement | 0.111 |
Goodness-of-fit parameter for all reflections included in the refinement | 1.024 |
Diffraction radiation probe | x-ray |
Diffraction radiation wavelength | 1.54184 Å |
Diffraction radiation type | CuKα |