Information card for entry 4346233
Formula | C51 H88 Mn4 N8 Te4 |
Calculated formula | C50.998 H87.994 Mn4 N7.999 Te4 |
Title of publication | Ligand Control of Manganese Telluride Molecular Cluster Core Nuclearity. |
Authors of publication | Choi, Bonnie; Paley, Daniel W.; Siegrist, Theo; Steigerwald, Michael L.; Roy, Xavier |
Journal of publication | Inorganic chemistry |
Year of publication | 2015 |
Journal volume | 54 |
Journal issue | 17 |
Pages of publication | 8348 - 8355 |
a | 13.84818 ± 0.00018 Å |
b | 19.8259 ± 0.0003 Å |
c | 24.1907 ± 0.0004 Å |
α | 93.2204 ± 0.0011° |
β | 103.864 ± 0.0012° |
γ | 97.4031 ± 0.0011° |
Cell volume | 6368.18 ± 0.17 Å3 |
Cell temperature | 100 K |
Ambient diffraction temperature | 100 K |
Number of distinct elements | 5 |
Space group number | 2 |
Hermann-Mauguin space group symbol | P -1 |
Hall space group symbol | -P 1 |
Residual factor for all reflections | 0.0657 |
Residual factor for significantly intense reflections | 0.0466 |
Weighted residual factors for significantly intense reflections | 0.0901 |
Weighted residual factors for all reflections included in the refinement | 0.0977 |
Goodness-of-fit parameter for all reflections included in the refinement | 1.115 |
Diffraction radiation probe | x-ray |
Diffraction radiation wavelength | 0.71073 Å |
Diffraction radiation type | MoKα |