Information card for entry 4346262
Formula | C15 H14 Cl N5 O Pd |
Calculated formula | C15 H14 Cl N5 O Pd |
SMILES | [Pd]12(N(=NC(=O)c3[n]2cccc3)=C(c2[n]1cccc2)C)Cl.N#CC |
Title of publication | Coordination Structure Conversion of Hydrazone-Palladium(II) Complexes in the Solid State and in Solution. |
Authors of publication | Kitamura, Fumi; Sawaguchi, Kana; Mori, Asami; Takagi, Shoji; Suzuki, Takayoshi; Kobayashi, Atsushi; Kato, Masako; Nakajima, Kiyohiko |
Journal of publication | Inorganic chemistry |
Year of publication | 2015 |
Journal volume | 54 |
Journal issue | 17 |
Pages of publication | 8436 - 8448 |
a | 6.8017 ± 0.0009 Å |
b | 12.8053 ± 0.0017 Å |
c | 18.244 ± 0.003 Å |
α | 90° |
β | 98.674 ± 0.004° |
γ | 90° |
Cell volume | 1570.8 ± 0.4 Å3 |
Cell temperature | 298 K |
Ambient diffraction temperature | 298 K |
Number of distinct elements | 6 |
Space group number | 14 |
Hermann-Mauguin space group symbol | P 1 21/a 1 |
Hall space group symbol | -P 2yab |
Residual factor for all reflections | 0.2313 |
Residual factor for significantly intense reflections | 0.095 |
Weighted residual factors for significantly intense reflections | 0.191 |
Weighted residual factors for all reflections included in the refinement | 0.2464 |
Goodness-of-fit parameter for all reflections included in the refinement | 1.036 |
Diffraction radiation wavelength | 0.71075 Å |
Diffraction radiation type | MoKα |