Information card for entry 4346263
Formula | C15 H14 Cl N5 O Pd |
Calculated formula | C15 H14 Cl N5 O Pd |
SMILES | [Pd]12(N(N=C(c3[n]1cccc3)C)C(=O)c1[n]2cccc1)Cl.N#CC |
Title of publication | Coordination Structure Conversion of Hydrazone-Palladium(II) Complexes in the Solid State and in Solution. |
Authors of publication | Kitamura, Fumi; Sawaguchi, Kana; Mori, Asami; Takagi, Shoji; Suzuki, Takayoshi; Kobayashi, Atsushi; Kato, Masako; Nakajima, Kiyohiko |
Journal of publication | Inorganic chemistry |
Year of publication | 2015 |
Journal volume | 54 |
Journal issue | 17 |
Pages of publication | 8436 - 8448 |
a | 16.224 ± 0.0006 Å |
b | 4.2386 ± 0.0002 Å |
c | 23.1836 ± 0.0009 Å |
α | 90° |
β | 91.243 ± 0.001° |
γ | 90° |
Cell volume | 1593.89 ± 0.11 Å3 |
Cell temperature | 298 K |
Ambient diffraction temperature | 298 K |
Number of distinct elements | 6 |
Space group number | 14 |
Hermann-Mauguin space group symbol | P 1 21/c 1 |
Hall space group symbol | -P 2ybc |
Residual factor for all reflections | 0.0922 |
Residual factor for significantly intense reflections | 0.0596 |
Weighted residual factors for significantly intense reflections | 0.117 |
Weighted residual factors for all reflections included in the refinement | 0.1286 |
Goodness-of-fit parameter for all reflections included in the refinement | 1.113 |
Diffraction radiation wavelength | 0.71075 Å |
Diffraction radiation type | MoKα |