Information card for entry 4346274
Formula | C104.8 H133.8 Dy3 N11 Ni6 O38.1 |
Calculated formula | C104.8 H131 Dy3 N11 Ni6 O38.1 |
Title of publication | Enneanuclear [Ni6Ln3] Cages: [Ln(III)3] Triangles Capping [Ni(II)6] Trigonal Prisms Including a [Ni6Dy3] Single-Molecule Magnet. |
Authors of publication | Canaj, Angelos B.; Tzimopoulos, Demetrios I.; Siczek, Milosz; Lis, Tadeusz; Inglis, Ross; Milios, Constantinos J. |
Journal of publication | Inorganic chemistry |
Year of publication | 2015 |
Journal volume | 54 |
Journal issue | 14 |
Pages of publication | 7089 - 7095 |
a | 15.021 ± 0.004 Å |
b | 15.27 ± 0.005 Å |
c | 26.43 ± 0.008 Å |
α | 93.7 ± 0.02° |
β | 91.76 ± 0.02° |
γ | 94.76 ± 0.02° |
Cell volume | 6025 ± 3 Å3 |
Cell temperature | 80 ± 2 K |
Ambient diffraction temperature | 80 ± 2 K |
Number of distinct elements | 6 |
Space group number | 2 |
Hermann-Mauguin space group symbol | P -1 |
Hall space group symbol | -P 1 |
Residual factor for all reflections | 0.1862 |
Residual factor for significantly intense reflections | 0.0872 |
Weighted residual factors for significantly intense reflections | 0.1194 |
Weighted residual factors for all reflections included in the refinement | 0.1477 |
Goodness-of-fit parameter for all reflections included in the refinement | 1.051 |
Diffraction radiation wavelength | 0.71073 Å |
Diffraction radiation type | MoKα |