Information card for entry 4346275
Formula | C109.5 H136.25 Gd3 N14.75 Ni6 O36.5 |
Calculated formula | C109.5 H136.25 Gd3.0431 N14.75 Ni6 O36.5 |
Title of publication | Enneanuclear [Ni6Ln3] Cages: [Ln(III)3] Triangles Capping [Ni(II)6] Trigonal Prisms Including a [Ni6Dy3] Single-Molecule Magnet. |
Authors of publication | Canaj, Angelos B.; Tzimopoulos, Demetrios I.; Siczek, Milosz; Lis, Tadeusz; Inglis, Ross; Milios, Constantinos J. |
Journal of publication | Inorganic chemistry |
Year of publication | 2015 |
Journal volume | 54 |
Journal issue | 14 |
Pages of publication | 7089 - 7095 |
a | 15.024 ± 0.006 Å |
b | 15.231 ± 0.006 Å |
c | 26.365 ± 0.008 Å |
α | 94.15 ± 0.04° |
β | 93.28 ± 0.05° |
γ | 94.54 ± 0.05° |
Cell volume | 5986 ± 4 Å3 |
Cell temperature | 80 ± 2 K |
Ambient diffraction temperature | 80 ± 2 K |
Number of distinct elements | 6 |
Space group number | 2 |
Hermann-Mauguin space group symbol | P -1 |
Hall space group symbol | -P 1 |
Residual factor for all reflections | 0.2315 |
Residual factor for significantly intense reflections | 0.1735 |
Weighted residual factors for significantly intense reflections | 0.3799 |
Weighted residual factors for all reflections included in the refinement | 0.3938 |
Goodness-of-fit parameter for all reflections included in the refinement | 2.295 |
Diffraction radiation wavelength | 0.71073 Å |
Diffraction radiation type | MoKα |