Information card for entry 4346282
Formula | C90 H28 N3 Pt |
Calculated formula | C90 H28 N3 Pt |
Title of publication | Coassembly-Directed Fabrication of an Exfoliated Form of Alternating Multilayers Composed of a Self-assembled Organoplatinum(II) Complex-Fullerene Dyad. |
Authors of publication | Sato, Satoru; Takei, Toshiaki; Matsushita, Yoshitaka; Yasuda, Takeshi; Kojima, Tatsuhiro; Kawano, Masaki; Ohnuma, Masato; Tashiro, Kentaro |
Journal of publication | Inorganic chemistry |
Year of publication | 2015 |
Journal volume | 54 |
Journal issue | 24 |
Pages of publication | 11581 - 11583 |
a | 17.8751 ± 0.0005 Å |
b | 28.8808 ± 0.0007 Å |
c | 9.969 ± 0.0002 Å |
α | 90° |
β | 100.14 ± 0.001° |
γ | 90° |
Cell volume | 5066.1 ± 0.2 Å3 |
Cell temperature | 100 ± 2 K |
Ambient diffraction temperature | 100 ± 2 K |
Number of distinct elements | 4 |
Space group number | 14 |
Hermann-Mauguin space group symbol | P 1 21/c 1 |
Hall space group symbol | -P 2ybc |
Residual factor for all reflections | 0.1593 |
Residual factor for significantly intense reflections | 0.1288 |
Weighted residual factors for significantly intense reflections | 0.3529 |
Weighted residual factors for all reflections included in the refinement | 0.3674 |
Goodness-of-fit parameter for all reflections included in the refinement | 1.242 |
Diffraction radiation wavelength | 0.6889 Å |
Diffraction radiation type | synchrotron |