Information card for entry 4346283
Formula | C24 H16 N2 Pt |
Calculated formula | C24 H16 N2 Pt |
SMILES | [Pt]12(c3c(c4[n]1cccc4)cccc3c1[n]2cccc1)C#Cc1ccccc1 |
Title of publication | Coassembly-Directed Fabrication of an Exfoliated Form of Alternating Multilayers Composed of a Self-assembled Organoplatinum(II) Complex-Fullerene Dyad. |
Authors of publication | Sato, Satoru; Takei, Toshiaki; Matsushita, Yoshitaka; Yasuda, Takeshi; Kojima, Tatsuhiro; Kawano, Masaki; Ohnuma, Masato; Tashiro, Kentaro |
Journal of publication | Inorganic chemistry |
Year of publication | 2015 |
Journal volume | 54 |
Journal issue | 24 |
Pages of publication | 11581 - 11583 |
a | 12.1117 ± 0.0003 Å |
b | 11.3911 ± 0.0003 Å |
c | 26.8478 ± 0.0007 Å |
α | 90° |
β | 90.736 ± 0.001° |
γ | 90° |
Cell volume | 3703.77 ± 0.17 Å3 |
Cell temperature | 100 ± 2 K |
Ambient diffraction temperature | 100 ± 2 K |
Number of distinct elements | 4 |
Space group number | 14 |
Hermann-Mauguin space group symbol | P 1 21/n 1 |
Hall space group symbol | -P 2yn |
Residual factor for all reflections | 0.0607 |
Residual factor for significantly intense reflections | 0.047 |
Weighted residual factors for significantly intense reflections | 0.1214 |
Weighted residual factors for all reflections included in the refinement | 0.1304 |
Goodness-of-fit parameter for all reflections included in the refinement | 1.096 |
Diffraction radiation wavelength | 0.6889 Å |
Diffraction radiation type | synchrotron |