Information card for entry 4346333
Formula | C30 H27 B2 F8 Fe N25 |
Calculated formula | C30 H27 B2 F8 Fe N25 |
Title of publication | Independent Control of Optical and Explosive Properties: Pyrazole-Tetrazine Complexes of First Row Transition Metals. |
Authors of publication | Myers, Thomas W.; Chavez, David E.; Hanson, Susan K.; Scharff, R. Jason; Scott, Brian L.; Veauthier, Jacqueline M.; Wu, Ruilian |
Journal of publication | Inorganic chemistry |
Year of publication | 2015 |
Journal volume | 54 |
Journal issue | 16 |
Pages of publication | 8077 - 8086 |
a | 16.4405 ± 0.0018 Å |
b | 16.4405 ± 0.0018 Å |
c | 16.4405 ± 0.0018 Å |
α | 90° |
β | 90° |
γ | 90° |
Cell volume | 4443.7 ± 0.8 Å3 |
Cell temperature | 100 ± 2 K |
Ambient diffraction temperature | 100 ± 2 K |
Number of distinct elements | 6 |
Space group number | 198 |
Hermann-Mauguin space group symbol | P 21 3 |
Hall space group symbol | P 2ac 2ab 3 |
Residual factor for all reflections | 0.1001 |
Residual factor for significantly intense reflections | 0.0954 |
Weighted residual factors for significantly intense reflections | 0.2193 |
Weighted residual factors for all reflections included in the refinement | 0.2219 |
Goodness-of-fit parameter for all reflections included in the refinement | 1.175 |
Diffraction radiation wavelength | 0.71073 Å |
Diffraction radiation type | MoKα |