Information card for entry 4346334
Formula | C37 H33 B2 F8 Fe N28 O12 |
Calculated formula | C37 H33 B2 F8 Fe N28 O12 |
Title of publication | Independent Control of Optical and Explosive Properties: Pyrazole-Tetrazine Complexes of First Row Transition Metals. |
Authors of publication | Myers, Thomas W.; Chavez, David E.; Hanson, Susan K.; Scharff, R. Jason; Scott, Brian L.; Veauthier, Jacqueline M.; Wu, Ruilian |
Journal of publication | Inorganic chemistry |
Year of publication | 2015 |
Journal volume | 54 |
Journal issue | 16 |
Pages of publication | 8077 - 8086 |
a | 23.635 ± 0.008 Å |
b | 16.117 ± 0.005 Å |
c | 28.985 ± 0.009 Å |
α | 90° |
β | 90° |
γ | 90° |
Cell volume | 11041 ± 6 Å3 |
Cell temperature | 100 ± 2 K |
Ambient diffraction temperature | 100 ± 2 K |
Number of distinct elements | 7 |
Space group number | 61 |
Hermann-Mauguin space group symbol | P b c a |
Hall space group symbol | -P 2ac 2ab |
Residual factor for all reflections | 0.1054 |
Residual factor for significantly intense reflections | 0.0912 |
Weighted residual factors for significantly intense reflections | 0.2327 |
Weighted residual factors for all reflections included in the refinement | 0.2443 |
Goodness-of-fit parameter for all reflections included in the refinement | 1.095 |
Diffraction radiation wavelength | 0.71073 Å |
Diffraction radiation type | MoKα |