Information card for entry 4346339
Formula | C16 H23 Cu F6 N14 O0.5 P |
Calculated formula | C16 H23 Cu F6 N14 O0.5 P |
Title of publication | Independent Control of Optical and Explosive Properties: Pyrazole-Tetrazine Complexes of First Row Transition Metals. |
Authors of publication | Myers, Thomas W.; Chavez, David E.; Hanson, Susan K.; Scharff, R. Jason; Scott, Brian L.; Veauthier, Jacqueline M.; Wu, Ruilian |
Journal of publication | Inorganic chemistry |
Year of publication | 2015 |
Journal volume | 54 |
Journal issue | 16 |
Pages of publication | 8077 - 8086 |
a | 26.06 ± 0.005 Å |
b | 13.326 ± 0.002 Å |
c | 18.396 ± 0.004 Å |
α | 90° |
β | 127.049 ± 0.004° |
γ | 90° |
Cell volume | 5098.8 ± 1.7 Å3 |
Cell temperature | 100 ± 2 K |
Ambient diffraction temperature | 100 ± 2 K |
Number of distinct elements | 7 |
Space group number | 15 |
Hermann-Mauguin space group symbol | C 1 2/c 1 |
Hall space group symbol | -C 2yc |
Residual factor for all reflections | 0.0934 |
Residual factor for significantly intense reflections | 0.0873 |
Weighted residual factors for significantly intense reflections | 0.2384 |
Weighted residual factors for all reflections included in the refinement | 0.2544 |
Goodness-of-fit parameter for all reflections included in the refinement | 1.051 |
Diffraction radiation wavelength | 0.71073 Å |
Diffraction radiation type | MoKα |