Information card for entry 4346340
Formula | C21.5 H25 Cu F4.8 N18 O8.5 P0.8 |
Calculated formula | C21.5 H25 Cu F4.8 N18 O8.5 P0.8 |
Title of publication | Independent Control of Optical and Explosive Properties: Pyrazole-Tetrazine Complexes of First Row Transition Metals. |
Authors of publication | Myers, Thomas W.; Chavez, David E.; Hanson, Susan K.; Scharff, R. Jason; Scott, Brian L.; Veauthier, Jacqueline M.; Wu, Ruilian |
Journal of publication | Inorganic chemistry |
Year of publication | 2015 |
Journal volume | 54 |
Journal issue | 16 |
Pages of publication | 8077 - 8086 |
a | 24.52 ± 0.01 Å |
b | 13.22 ± 0.005 Å |
c | 21.745 ± 0.009 Å |
α | 90° |
β | 96.349 ± 0.004° |
γ | 90° |
Cell volume | 7006 ± 5 Å3 |
Cell temperature | 100 ± 2 K |
Ambient diffraction temperature | 100 ± 2 K |
Number of distinct elements | 7 |
Space group number | 9 |
Hermann-Mauguin space group symbol | C 1 c 1 |
Hall space group symbol | C -2yc |
Residual factor for all reflections | 0.0941 |
Residual factor for significantly intense reflections | 0.0752 |
Weighted residual factors for significantly intense reflections | 0.2147 |
Weighted residual factors for all reflections included in the refinement | 0.2325 |
Goodness-of-fit parameter for all reflections included in the refinement | 1.093 |
Diffraction radiation wavelength | 0.71073 Å |
Diffraction radiation type | MoKα |