Information card for entry 4346373
Formula | C24 H54 Cl P3 Se6 U |
Calculated formula | C24 H54 Cl P3 Se6 U |
SMILES | [U]123([Se]=P([Se]1)(C(C)(C)C)C(C)(C)C)([Se]=P([Se]2)(C(C)(C)C)C(C)(C)C)([Se]=P([Se]3)(C(C)(C)C)C(C)(C)C)Cl |
Title of publication | Dithio- and Diselenophosphinate Thorium(IV) and Uranium(IV) Complexes: Molecular and Electronic Structures, Spectroscopy, and Transmetalation Reactivity. |
Authors of publication | Behrle, Andrew C.; Kerridge, Andrew; Walensky, Justin R. |
Journal of publication | Inorganic chemistry |
Year of publication | 2015 |
Journal volume | 54 |
Journal issue | 24 |
Pages of publication | 11625 - 11636 |
a | 10.7542 ± 0.0015 Å |
b | 16.203 ± 0.002 Å |
c | 22.059 ± 0.003 Å |
α | 90° |
β | 90° |
γ | 90° |
Cell volume | 3843.8 ± 0.9 Å3 |
Cell temperature | 100 ± 2 K |
Ambient diffraction temperature | 100 ± 2 K |
Number of distinct elements | 6 |
Space group number | 19 |
Hermann-Mauguin space group symbol | P 21 21 21 |
Hall space group symbol | P 2ac 2ab |
Residual factor for all reflections | 0.0208 |
Residual factor for significantly intense reflections | 0.0175 |
Weighted residual factors for significantly intense reflections | 0.0391 |
Weighted residual factors for all reflections included in the refinement | 0.0408 |
Goodness-of-fit parameter for all reflections included in the refinement | 0.65 |
Diffraction radiation wavelength | 0.71073 Å |
Diffraction radiation type | MoKα |