Information card for entry 4346374
Formula | C18 H12 N2 O4 Pt |
Calculated formula | C18 H12 N2 O4 Pt |
SMILES | [Pt]12(c3cc(ccc3c3[n]2cccc3)C(=O)O)OC(=O)c2[n]1cccc2 |
Title of publication | Impact of a carboxyl group on a cyclometalated ligand: hydrogen-bond- and coordination-driven self-assembly of a luminescent platinum(II) complex. |
Authors of publication | Ebina, Masanori; Kobayashi, Atsushi; Ogawa, Tomohiro; Yoshida, Masaki; Kato, Masako |
Journal of publication | Inorganic chemistry |
Year of publication | 2015 |
Journal volume | 54 |
Journal issue | 18 |
Pages of publication | 8878 - 8880 |
a | 9.63 ± 0.005 Å |
b | 21.537 ± 0.01 Å |
c | 7.132 ± 0.003 Å |
α | 90° |
β | 92.915 ± 0.007° |
γ | 90° |
Cell volume | 1477.3 ± 1.2 Å3 |
Cell temperature | 200 K |
Ambient diffraction temperature | 200 K |
Number of distinct elements | 5 |
Space group number | 14 |
Hermann-Mauguin space group symbol | P 1 21/c 1 |
Hall space group symbol | -P 2ybc |
Residual factor for all reflections | 0.062 |
Residual factor for significantly intense reflections | 0.0517 |
Weighted residual factors for significantly intense reflections | 0.1161 |
Weighted residual factors for all reflections included in the refinement | 0.1208 |
Goodness-of-fit parameter for all reflections included in the refinement | 1.129 |
Diffraction radiation wavelength | 0.71075 Å |
Diffraction radiation type | MoKα |