Information card for entry 4346414
Formula | C33 H29 F6 N2 P3 |
Calculated formula | C33 H29 F6 N2 P3 |
SMILES | P(Cn1c[n+](c2c1cccc2)CP(c1ccccc1)c1ccccc1)(c1ccccc1)c1ccccc1.[P](F)(F)(F)(F)(F)[F-] |
Title of publication | Toward new organometallic architectures: synthesis of carbene-centered rhodium and palladium bisphosphine complexes. stability and reactivity of [PC(BIm)PRh(L)][PF6] pincers. |
Authors of publication | Plikhta, Andriy; Pöthig, Alexander; Herdtweck, Eberhardt; Rieger, Bernhard |
Journal of publication | Inorganic chemistry |
Year of publication | 2015 |
Journal volume | 54 |
Journal issue | 19 |
Pages of publication | 9517 - 9528 |
a | 13.1758 ± 0.0005 Å |
b | 13.3209 ± 0.0005 Å |
c | 18.7343 ± 0.0006 Å |
α | 75.565 ± 0.002° |
β | 72.988 ± 0.001° |
γ | 82.484 ± 0.002° |
Cell volume | 3039.03 ± 0.19 Å3 |
Cell temperature | 123 K |
Ambient diffraction temperature | 123 K |
Number of distinct elements | 5 |
Space group number | 2 |
Hermann-Mauguin space group symbol | P -1 |
Hall space group symbol | -P 1 |
Residual factor for all reflections | 0.0366 |
Residual factor for significantly intense reflections | 0.0294 |
Weighted residual factors for significantly intense reflections | 0.0725 |
Weighted residual factors for all reflections included in the refinement | 0.0764 |
Goodness-of-fit parameter for all reflections included in the refinement | 1.042 |
Diffraction radiation probe | x-ray |
Diffraction radiation wavelength | 0.71073 Å |
Diffraction radiation type | MoKα |