Information card for entry 4346415
Formula | C37 H40 F6 N2 O2 P3 Rh S2 |
Calculated formula | C37 H40 F6 N2 O2 P3 Rh S2 |
Title of publication | Toward new organometallic architectures: synthesis of carbene-centered rhodium and palladium bisphosphine complexes. stability and reactivity of [PC(BIm)PRh(L)][PF6] pincers. |
Authors of publication | Plikhta, Andriy; Pöthig, Alexander; Herdtweck, Eberhardt; Rieger, Bernhard |
Journal of publication | Inorganic chemistry |
Year of publication | 2015 |
Journal volume | 54 |
Journal issue | 19 |
Pages of publication | 9517 - 9528 |
a | 16.8923 ± 0.0004 Å |
b | 23.2464 ± 0.0006 Å |
c | 19.7992 ± 0.0005 Å |
α | 90° |
β | 95.9309 ± 0.0012° |
γ | 90° |
Cell volume | 7733.2 ± 0.3 Å3 |
Cell temperature | 123 ± 1 K |
Ambient diffraction temperature | 123 ± 1 K |
Number of distinct elements | 8 |
Space group number | 15 |
Hermann-Mauguin space group symbol | C 1 2/c 1 |
Hall space group symbol | -C 2yc |
Residual factor for all reflections | 0.0542 |
Residual factor for significantly intense reflections | 0.0512 |
Weighted residual factors for significantly intense reflections | 0.1255 |
Weighted residual factors for all reflections included in the refinement | 0.1271 |
Goodness-of-fit parameter for all reflections included in the refinement | 1.207 |
Diffraction radiation wavelength | 0.71073 Å |
Diffraction radiation type | MoKα |