Information card for entry 4346419
Formula | C70 H67 F6 N4 O P5 Rh2 |
Calculated formula | C69.998 H66.995 F6 N4 O P5 Rh2 |
Title of publication | Toward new organometallic architectures: synthesis of carbene-centered rhodium and palladium bisphosphine complexes. stability and reactivity of [PC(BIm)PRh(L)][PF6] pincers. |
Authors of publication | Plikhta, Andriy; Pöthig, Alexander; Herdtweck, Eberhardt; Rieger, Bernhard |
Journal of publication | Inorganic chemistry |
Year of publication | 2015 |
Journal volume | 54 |
Journal issue | 19 |
Pages of publication | 9517 - 9528 |
a | 12.0213 ± 0.0003 Å |
b | 15.1548 ± 0.0004 Å |
c | 18.3327 ± 0.0005 Å |
α | 99.852 ± 0.002° |
β | 103.228 ± 0.001° |
γ | 94.338 ± 0.001° |
Cell volume | 3180.27 ± 0.15 Å3 |
Cell temperature | 123 K |
Ambient diffraction temperature | 123 K |
Number of distinct elements | 7 |
Space group number | 2 |
Hermann-Mauguin space group symbol | P -1 |
Hall space group symbol | -P 1 |
Residual factor for all reflections | 0.0329 |
Residual factor for significantly intense reflections | 0.0257 |
Weighted residual factors for significantly intense reflections | 0.0595 |
Weighted residual factors for all reflections included in the refinement | 0.0621 |
Goodness-of-fit parameter for all reflections included in the refinement | 1.035 |
Diffraction radiation probe | x-ray |
Diffraction radiation wavelength | 0.71073 Å |
Diffraction radiation type | MoKα |