Information card for entry 4346420
Formula | C27 H21 F12 Mn N2 O6 |
Calculated formula | C27 H21 F12 Mn N2 O6 |
Title of publication | A single-chain magnet with a very high blocking temperature and a strong coercive field. |
Authors of publication | Cassaro, Rafael A Allão; Reis, Samira G.; Araujo, Thamyres S.; Lahti, Paul M.; Novak, Miguel A.; Vaz, Maria G. F. |
Journal of publication | Inorganic chemistry |
Year of publication | 2015 |
Journal volume | 54 |
Journal issue | 19 |
Pages of publication | 9381 - 9383 |
a | 11.85 ± 0.002 Å |
b | 14.358 ± 0.003 Å |
c | 18.744 ± 0.004 Å |
α | 90° |
β | 104.845 ± 0.006° |
γ | 90° |
Cell volume | 3082.7 ± 1.1 Å3 |
Cell temperature | 150 ± 2 K |
Ambient diffraction temperature | 150 ± 2 K |
Number of distinct elements | 6 |
Space group number | 14 |
Hermann-Mauguin space group symbol | P 1 21/n 1 |
Hall space group symbol | -P 2yn |
Residual factor for all reflections | 0.1521 |
Residual factor for significantly intense reflections | 0.0773 |
Weighted residual factors for significantly intense reflections | 0.1386 |
Weighted residual factors for all reflections included in the refinement | 0.1649 |
Goodness-of-fit parameter for all reflections included in the refinement | 1.056 |
Diffraction radiation wavelength | 0.71073 Å |
Diffraction radiation type | MoKα |