Information card for entry 4346455
Formula | C44 H73 N11 O2 U |
Calculated formula | C44 H73 N11 O2 U |
Title of publication | Uranium(III) redox chemistry assisted by a hemilabile bis(phenolate) cyclam ligand: uranium-nitrogen multiple bond formation comprising a trans-{RN═U(VI)═NR}(2+) complex. |
Authors of publication | Maria, Leonor; Santos, Isabel C.; Sousa, Vânia R; Marçalo, Joaquim |
Journal of publication | Inorganic chemistry |
Year of publication | 2015 |
Journal volume | 54 |
Journal issue | 18 |
Pages of publication | 9115 - 9126 |
a | 10.1487 ± 0.0002 Å |
b | 13.5956 ± 0.0002 Å |
c | 19.218 ± 0.004 Å |
α | 72.143 ± 0.002° |
β | 75.293 ± 0.002° |
γ | 69.787 ± 0.001° |
Cell volume | 2335.8 ± 0.5 Å3 |
Cell temperature | 150 ± 2 K |
Ambient diffraction temperature | 150 ± 2 K |
Number of distinct elements | 5 |
Space group number | 2 |
Hermann-Mauguin space group symbol | P -1 |
Hall space group symbol | -P 1 |
Residual factor for all reflections | 0.026 |
Residual factor for significantly intense reflections | 0.0223 |
Weighted residual factors for significantly intense reflections | 0.052 |
Weighted residual factors for all reflections included in the refinement | 0.0531 |
Goodness-of-fit parameter for all reflections included in the refinement | 1.041 |
Diffraction radiation wavelength | 0.71073 Å |
Diffraction radiation type | MoKα |