Information card for entry 4346456
Formula | C99 H155 N15 O4 U2 |
Calculated formula | C99 H155 N15 O4 U2 |
Title of publication | Uranium(III) redox chemistry assisted by a hemilabile bis(phenolate) cyclam ligand: uranium-nitrogen multiple bond formation comprising a trans-{RN═U(VI)═NR}(2+) complex. |
Authors of publication | Maria, Leonor; Santos, Isabel C.; Sousa, Vânia R; Marçalo, Joaquim |
Journal of publication | Inorganic chemistry |
Year of publication | 2015 |
Journal volume | 54 |
Journal issue | 18 |
Pages of publication | 9115 - 9126 |
a | 14.9305 ± 0.0006 Å |
b | 17.8268 ± 0.0007 Å |
c | 18.5796 ± 0.0008 Å |
α | 91.177 ± 0.002° |
β | 97.279 ± 0.002° |
γ | 95.629 ± 0.002° |
Cell volume | 4879 ± 0.3 Å3 |
Cell temperature | 150 ± 2 K |
Ambient diffraction temperature | 150 ± 2 K |
Number of distinct elements | 5 |
Space group number | 2 |
Hermann-Mauguin space group symbol | P -1 |
Hall space group symbol | -P 1 |
Residual factor for all reflections | 0.0529 |
Residual factor for significantly intense reflections | 0.0338 |
Weighted residual factors for significantly intense reflections | 0.0741 |
Weighted residual factors for all reflections included in the refinement | 0.0784 |
Goodness-of-fit parameter for all reflections included in the refinement | 1.025 |
Diffraction radiation wavelength | 0.71073 Å |
Diffraction radiation type | MoKα |