Information card for entry 4346479
Formula | C8 H23 Mn2 N2 O17 P2 |
Calculated formula | C8 H23 Mn2 N2 O17 P2 |
Title of publication | Solvent-free synthesis of crystalline metal phosphate oxalates with a (4,6)-connected fsh topology. |
Authors of publication | Luan, Lindong; Li, Jing; Chen, Cheng; Lin, Zhien; Huang, Hui |
Journal of publication | Inorganic chemistry |
Year of publication | 2015 |
Journal volume | 54 |
Journal issue | 19 |
Pages of publication | 9387 - 9389 |
a | 8.8946 ± 0.0004 Å |
b | 9.8125 ± 0.0005 Å |
c | 12.2507 ± 0.0006 Å |
α | 81.742 ± 0.004° |
β | 71.831 ± 0.004° |
γ | 72.827 ± 0.004° |
Cell volume | 969.05 ± 0.09 Å3 |
Cell temperature | 293 K |
Ambient diffraction temperature | 293 K |
Number of distinct elements | 6 |
Space group number | 2 |
Hermann-Mauguin space group symbol | P -1 |
Hall space group symbol | -P 1 |
Residual factor for all reflections | 0.0874 |
Residual factor for significantly intense reflections | 0.0842 |
Weighted residual factors for significantly intense reflections | 0.2191 |
Weighted residual factors for all reflections included in the refinement | 0.227 |
Goodness-of-fit parameter for all reflections included in the refinement | 1.02 |
Diffraction radiation probe | x-ray |
Diffraction radiation wavelength | 1.54184 Å |
Diffraction radiation type | CuKα |