Information card for entry 4346480
Formula | C9 H19 Mn2 N1.5 O15 P1.5 |
Calculated formula | C9 H19 Mn2 N1.5 O15 P1.5 |
Title of publication | Solvent-free synthesis of crystalline metal phosphate oxalates with a (4,6)-connected fsh topology. |
Authors of publication | Luan, Lindong; Li, Jing; Chen, Cheng; Lin, Zhien; Huang, Hui |
Journal of publication | Inorganic chemistry |
Year of publication | 2015 |
Journal volume | 54 |
Journal issue | 19 |
Pages of publication | 9387 - 9389 |
a | 15.368 ± 0.0004 Å |
b | 11.4122 ± 0.0003 Å |
c | 22.2812 ± 0.0005 Å |
α | 90° |
β | 101.847 ± 0.003° |
γ | 90° |
Cell volume | 3824.5 ± 0.17 Å3 |
Cell temperature | 293 K |
Ambient diffraction temperature | 293 K |
Number of distinct elements | 6 |
Space group number | 15 |
Hermann-Mauguin space group symbol | C 1 2/c 1 |
Hall space group symbol | -C 2yc |
Residual factor for all reflections | 0.0487 |
Residual factor for significantly intense reflections | 0.0411 |
Weighted residual factors for significantly intense reflections | 0.1001 |
Weighted residual factors for all reflections included in the refinement | 0.1061 |
Goodness-of-fit parameter for all reflections included in the refinement | 1.04 |
Diffraction radiation probe | x-ray |
Diffraction radiation wavelength | 0.71073 Å |
Diffraction radiation type | MoKα |