Information card for entry 4346531
Formula | C40 H74 Fe N4 Si4 |
Calculated formula | C40 H74 Fe N4 Si4 |
Title of publication | Accessing sodium ferrate complexes containing neutral and anionic N-heterocyclic carbene ligands: structural, synthetic, and magnetic insights. |
Authors of publication | Maddock, Lewis C. H.; Cadenbach, Thomas; Kennedy, Alan R.; Borilovic, Ivana; Aromí, Guillem; Hevia, Eva |
Journal of publication | Inorganic chemistry |
Year of publication | 2015 |
Journal volume | 54 |
Journal issue | 18 |
Pages of publication | 9201 - 9210 |
a | 13.5831 ± 0.0003 Å |
b | 16.1634 ± 0.0004 Å |
c | 21.244 ± 0.0006 Å |
α | 90° |
β | 90.268 ± 0.003° |
γ | 90° |
Cell volume | 4664 ± 0.2 Å3 |
Cell temperature | 123 ± 2 K |
Ambient diffraction temperature | 123 ± 2 K |
Number of distinct elements | 5 |
Space group number | 14 |
Hermann-Mauguin space group symbol | P 1 21/n 1 |
Hall space group symbol | -P 2yn |
Residual factor for all reflections | 0.0608 |
Residual factor for significantly intense reflections | 0.0476 |
Weighted residual factors for significantly intense reflections | 0.1191 |
Weighted residual factors for all reflections included in the refinement | 0.1283 |
Goodness-of-fit parameter for all reflections included in the refinement | 1.017 |
Diffraction radiation wavelength | 1.5418 Å |
Diffraction radiation type | CuKα |