Information card for entry 4346532
Formula | C72 H126 Fe N7 Na Si6 |
Calculated formula | C72 H126 Fe N7 Na Si6 |
SMILES | C1(N(C=CN1c1c(cccc1C(C)C)C(C)C)c1c(cccc1C(C)C)C(C)C)=[Na]=C1N(C=CN1c1c(cccc1C(C)C)C(C)C)c1c(cccc1C(C)C)C(C)C.N([Fe](N([Si](C)(C)C)[Si](C)(C)C)N([Si](C)(C)C)[Si](C)(C)C)([Si](C)(C)C)[Si](C)(C)C |
Title of publication | Accessing sodium ferrate complexes containing neutral and anionic N-heterocyclic carbene ligands: structural, synthetic, and magnetic insights. |
Authors of publication | Maddock, Lewis C. H.; Cadenbach, Thomas; Kennedy, Alan R.; Borilovic, Ivana; Aromí, Guillem; Hevia, Eva |
Journal of publication | Inorganic chemistry |
Year of publication | 2015 |
Journal volume | 54 |
Journal issue | 18 |
Pages of publication | 9201 - 9210 |
a | 20.763 ± 0.003 Å |
b | 21.1154 ± 0.0019 Å |
c | 22.8 ± 0.006 Å |
α | 90° |
β | 122.634 ± 0.013° |
γ | 90° |
Cell volume | 8418 ± 3 Å3 |
Cell temperature | 123 ± 2 K |
Ambient diffraction temperature | 123 ± 2 K |
Number of distinct elements | 6 |
Space group number | 14 |
Hermann-Mauguin space group symbol | P 1 21/c 1 |
Hall space group symbol | -P 2ybc |
Residual factor for all reflections | 0.1543 |
Residual factor for significantly intense reflections | 0.0761 |
Weighted residual factors for significantly intense reflections | 0.1371 |
Weighted residual factors for all reflections included in the refinement | 0.1748 |
Goodness-of-fit parameter for all reflections included in the refinement | 0.994 |
Diffraction radiation wavelength | 0.7107 Å |
Diffraction radiation type | MoKα |