Information card for entry 4346600
Chemical name | catena-poly[(m3-iodide)(2-amino-5-nitropyridine)copper(I)]-acetic acid (1/1) |
Formula | C7 H9 Cu I N3 O4 |
Calculated formula | C7 H9 Cu I N3 O4 |
Title of publication | Halo and Pseudohalo Cu(I)-Pyridinato Double Chains with Tunable Physical Properties. |
Authors of publication | Hassanein, K.; Amo-Ochoa, P; Gómez-García, C J; Delgado, S.; Castillo, O.; Ocón, P; Martínez, J I; Perles, J.; Zamora, F. |
Journal of publication | Inorganic chemistry |
Year of publication | 2015 |
Journal volume | 54 |
Journal issue | 22 |
Pages of publication | 10738 - 10747 |
a | 4.1444 ± 0.0001 Å |
b | 11.3403 ± 0.0002 Å |
c | 15.0851 ± 0.0003 Å |
α | 108.66 ± 0.001° |
β | 93.975 ± 0.001° |
γ | 98.533 ± 0.001° |
Cell volume | 659.1 ± 0.02 Å3 |
Cell temperature | 296 ± 2 K |
Ambient diffraction temperature | 296 ± 2 K |
Number of distinct elements | 6 |
Space group number | 2 |
Hermann-Mauguin space group symbol | P -1 |
Hall space group symbol | -P 1 |
Residual factor for all reflections | 0.0243 |
Residual factor for significantly intense reflections | 0.0212 |
Weighted residual factors for significantly intense reflections | 0.0587 |
Weighted residual factors for all reflections included in the refinement | 0.0615 |
Goodness-of-fit parameter for all reflections included in the refinement | 1.117 |
Diffraction radiation wavelength | 0.71073 Å |