Information card for entry 4346601
Chemical name | catena-poly[(2-amino-5-nitropyridine-kN1)(mu-cyanido)copper(I)] |
Formula | C12 H10 Cu2 N8 O4 |
Calculated formula | C12 H10 Cu2 N8 O4 |
Title of publication | Halo and Pseudohalo Cu(I)-Pyridinato Double Chains with Tunable Physical Properties. |
Authors of publication | Hassanein, K.; Amo-Ochoa, P; Gómez-García, C J; Delgado, S.; Castillo, O.; Ocón, P; Martínez, J I; Perles, J.; Zamora, F. |
Journal of publication | Inorganic chemistry |
Year of publication | 2015 |
Journal volume | 54 |
Journal issue | 22 |
Pages of publication | 10738 - 10747 |
a | 14.6169 ± 0.0003 Å |
b | 7.2367 ± 0.0002 Å |
c | 16.1212 ± 0.0003 Å |
α | 90° |
β | 110.554 ± 0.001° |
γ | 90° |
Cell volume | 1596.72 ± 0.06 Å3 |
Cell temperature | 296 ± 2 K |
Ambient diffraction temperature | 296 ± 2 K |
Number of distinct elements | 5 |
Space group number | 13 |
Hermann-Mauguin space group symbol | P 1 2/n 1 |
Hall space group symbol | -P 2yac |
Residual factor for all reflections | 0.041 |
Residual factor for significantly intense reflections | 0.0271 |
Weighted residual factors for significantly intense reflections | 0.0579 |
Weighted residual factors for all reflections included in the refinement | 0.0627 |
Goodness-of-fit parameter for all reflections included in the refinement | 1.021 |
Diffraction radiation wavelength | 0.71073 Å |
Diffraction radiation type | MoKα |