Information card for entry 4346603
Formula | C18 H15 Cd1.5 O13 |
Calculated formula | C18 H15 Cd1.5 O13 |
Title of publication | Cadmium-Based Metal-Organic Framework as a Highly Selective and Sensitive Ratiometric Luminescent Sensor for Mercury(II). |
Authors of publication | Wu, Pengyan; Liu, Yanhong; Liu, Yi; Wang, Jingru; Li, Yang; Liu, Wei; Wang, Jian |
Journal of publication | Inorganic chemistry |
Year of publication | 2015 |
Journal volume | 54 |
Journal issue | 23 |
Pages of publication | 11046 - 11048 |
a | 9.9428 ± 0.0008 Å |
b | 10.4394 ± 0.0008 Å |
c | 14.5779 ± 0.0012 Å |
α | 107.05 ± 0.005° |
β | 109.127 ± 0.006° |
γ | 90.079 ± 0.005° |
Cell volume | 1358.8 ± 0.2 Å3 |
Cell temperature | 293 ± 2 K |
Ambient diffraction temperature | 293 ± 2 K |
Number of distinct elements | 4 |
Space group number | 2 |
Hermann-Mauguin space group symbol | P -1 |
Hall space group symbol | -P 1 |
Residual factor for all reflections | 0.0857 |
Residual factor for significantly intense reflections | 0.0617 |
Weighted residual factors for significantly intense reflections | 0.16 |
Weighted residual factors for all reflections included in the refinement | 0.1736 |
Goodness-of-fit parameter for all reflections included in the refinement | 1.009 |
Diffraction radiation wavelength | 0.71073 Å |
Diffraction radiation type | MoKα |