Information card for entry 4346604
Formula | C65 H53 Cu2 F42 Gd N6 O18 |
Calculated formula | C65 H53 Cu2 F42 Gd N6 O18 |
Title of publication | [(Cu-radical)2-Ln]: structure and magnetic properties of a hetero-tri-spin chain of rings (Ln = Y(III), Gd(III), Tb(III), Dy(III)). |
Authors of publication | Wang, Xiufeng; Hu, Peng; Li, Licun; Sutter, Jean-Pascal |
Journal of publication | Inorganic chemistry |
Year of publication | 2015 |
Journal volume | 54 |
Journal issue | 19 |
Pages of publication | 9664 - 9669 |
a | 12.319 ± 0.003 Å |
b | 24.455 ± 0.005 Å |
c | 28.738 ± 0.006 Å |
α | 90° |
β | 102.03 ± 0.03° |
γ | 90° |
Cell volume | 8468 ± 3 Å3 |
Cell temperature | 113 ± 2 K |
Ambient diffraction temperature | 113 ± 2 K |
Number of distinct elements | 7 |
Space group number | 14 |
Hermann-Mauguin space group symbol | P 1 21/c 1 |
Hall space group symbol | -P 2ybc |
Residual factor for all reflections | 0.0578 |
Residual factor for significantly intense reflections | 0.047 |
Weighted residual factors for significantly intense reflections | 0.1316 |
Weighted residual factors for all reflections included in the refinement | 0.1442 |
Goodness-of-fit parameter for all reflections included in the refinement | 1.018 |
Diffraction radiation wavelength | 0.71073 Å |
Diffraction radiation type | MoKα |