Information card for entry 4346608
Common name | [YFe(CN)6](hep)2(H2O)4,12sep25b |
Formula | C9 H15 Fe0.5 N4 O4 Y0.5 |
Calculated formula | C9 H15 Fe0.5 N4 O4 Y0.5 |
Title of publication | Tuning the Origin of Magnetic Relaxation by Substituting the 3d or Rare-Earth Ions into Three Isostructural Cyano-Bridged 3d-4f Heterodinuclear Compounds. |
Authors of publication | Zhang, Yan; Guo, Zhen; Xie, Shuang; Li, Hui-Li; Zhu, Wen-Hua; Liu, Li; Dong, Xun-Qing; He, Wei-Xun; Ren, Jin-Chao; Liu, Ling-Zhi; Powell, Annie K. |
Journal of publication | Inorganic chemistry |
Year of publication | 2015 |
Journal volume | 54 |
Journal issue | 21 |
Pages of publication | 10316 - 10322 |
a | 14.117 ± 0.006 Å |
b | 12.865 ± 0.006 Å |
c | 15.18 ± 0.006 Å |
α | 90° |
β | 109.588 ± 0.007° |
γ | 90° |
Cell volume | 2597.4 ± 1.9 Å3 |
Cell temperature | 296 ± 2 K |
Ambient diffraction temperature | 296.15 K |
Number of distinct elements | 6 |
Space group number | 15 |
Hermann-Mauguin space group symbol | C 1 2/c 1 |
Hall space group symbol | -C 2yc |
Residual factor for all reflections | 0.0364 |
Residual factor for significantly intense reflections | 0.029 |
Weighted residual factors for significantly intense reflections | 0.0731 |
Weighted residual factors for all reflections included in the refinement | 0.0755 |
Goodness-of-fit parameter for all reflections included in the refinement | 1.037 |
Diffraction radiation wavelength | 0.71073 Å |
Diffraction radiation type | MoKα |