Information card for entry 4346609
Common name | [DyCo(CN)6](hep)2(H2O)4,14Jun16d |
Formula | C9 H15 Co0.5 Dy0.5 N4 O4 |
Calculated formula | C9 H15 Co0.5 Dy0.5 N4 O4 |
Title of publication | Tuning the Origin of Magnetic Relaxation by Substituting the 3d or Rare-Earth Ions into Three Isostructural Cyano-Bridged 3d-4f Heterodinuclear Compounds. |
Authors of publication | Zhang, Yan; Guo, Zhen; Xie, Shuang; Li, Hui-Li; Zhu, Wen-Hua; Liu, Li; Dong, Xun-Qing; He, Wei-Xun; Ren, Jin-Chao; Liu, Ling-Zhi; Powell, Annie K. |
Journal of publication | Inorganic chemistry |
Year of publication | 2015 |
Journal volume | 54 |
Journal issue | 21 |
Pages of publication | 10316 - 10322 |
a | 14.1741 ± 0.0006 Å |
b | 12.9082 ± 0.0006 Å |
c | 15.2619 ± 0.0007 Å |
α | 90° |
β | 109.4 ± 0.002° |
γ | 90° |
Cell volume | 2633.8 ± 0.2 Å3 |
Cell temperature | 296 ± 2 K |
Ambient diffraction temperature | 296.6 K |
Number of distinct elements | 6 |
Space group number | 15 |
Hermann-Mauguin space group symbol | C 1 2/c 1 |
Hall space group symbol | -C 2yc |
Residual factor for all reflections | 0.0385 |
Residual factor for significantly intense reflections | 0.0288 |
Weighted residual factors for significantly intense reflections | 0.0566 |
Weighted residual factors for all reflections included in the refinement | 0.0598 |
Goodness-of-fit parameter for all reflections included in the refinement | 1.092 |
Diffraction radiation wavelength | 0.71073 Å |
Diffraction radiation type | MoKα |