Information card for entry 4346632
Formula | C15 H30 Fe N3 S6 |
Calculated formula | C15 H30 Fe N3 S6 |
Title of publication | Abrupt versus Gradual Spin-Crossover in Fe(II)(phen)2(NCS)2 and Fe(III)(dedtc)3 Compared by X-ray Absorption and Emission Spectroscopy and Quantum-Chemical Calculations. |
Authors of publication | Mebs, Stefan; Braun, Beatrice; Kositzki, Ramona; Limberg, Christian; Haumann, Michael |
Journal of publication | Inorganic chemistry |
Year of publication | 2015 |
Journal volume | 54 |
Journal issue | 24 |
Pages of publication | 11606 - 11624 |
a | 14.2766 ± 0.0002 Å |
b | 10.3755 ± 0.0002 Å |
c | 17.1718 ± 0.0003 Å |
α | 90° |
β | 111.579 ± 0.0006° |
γ | 90° |
Cell volume | 2365.32 ± 0.07 Å3 |
Cell temperature | 300 ± 2 K |
Ambient diffraction temperature | 300 ± 2 K |
Number of distinct elements | 5 |
Space group number | 14 |
Hermann-Mauguin space group symbol | P 1 21/n 1 |
Hall space group symbol | -P 2yn |
Residual factor for all reflections | 0.1103 |
Residual factor for significantly intense reflections | 0.0492 |
Weighted residual factors for significantly intense reflections | 0.0999 |
Weighted residual factors for all reflections included in the refinement | 0.1189 |
Goodness-of-fit parameter for all reflections included in the refinement | 1.012 |
Diffraction radiation wavelength | 0.71073 Å |
Diffraction radiation type | MoKα |