Information card for entry 4346633
Formula | C15 H30 Fe N3 S6 |
Calculated formula | C15 H30 Fe N3 S6 |
Title of publication | Abrupt versus Gradual Spin-Crossover in Fe(II)(phen)2(NCS)2 and Fe(III)(dedtc)3 Compared by X-ray Absorption and Emission Spectroscopy and Quantum-Chemical Calculations. |
Authors of publication | Mebs, Stefan; Braun, Beatrice; Kositzki, Ramona; Limberg, Christian; Haumann, Michael |
Journal of publication | Inorganic chemistry |
Year of publication | 2015 |
Journal volume | 54 |
Journal issue | 24 |
Pages of publication | 11606 - 11624 |
a | 14.3561 ± 0.0003 Å |
b | 10.4687 ± 0.0002 Å |
c | 17.2808 ± 0.0003 Å |
α | 90° |
β | 111.734 ± 0.0006° |
γ | 90° |
Cell volume | 2412.5 ± 0.08 Å3 |
Cell temperature | 350 ± 2 K |
Ambient diffraction temperature | 350 ± 2 K |
Number of distinct elements | 5 |
Space group number | 15 |
Hermann-Mauguin space group symbol | C 1 2/c 1 |
Hall space group symbol | -C 2yc |
Residual factor for all reflections | 0.0845 |
Residual factor for significantly intense reflections | 0.0428 |
Weighted residual factors for significantly intense reflections | 0.0872 |
Weighted residual factors for all reflections included in the refinement | 0.1008 |
Goodness-of-fit parameter for all reflections included in the refinement | 1.026 |
Diffraction radiation wavelength | 0.71073 Å |
Diffraction radiation type | MoKα |