Information card for entry 4346654
Chemical name | MgCPB |
Formula | C59 H55 Mg2 N O16 |
Calculated formula | C59 H55 Mg2 N O16 |
Title of publication | Synthesis and Selective CO2 Capture Properties of a Series of Hexatopic Linker-Based Metal-Organic Frameworks. |
Authors of publication | Nguyen, Phuong T. K.; Nguyen, Huong T. D.; Pham, Hung Q.; Kim, Jaheon; Cordova, Kyle E.; Furukawa, Hiroyasu |
Journal of publication | Inorganic chemistry |
Year of publication | 2015 |
Journal volume | 54 |
Journal issue | 20 |
Pages of publication | 10065 - 10072 |
a | 11.8582 ± 0.0006 Å |
b | 28.064 ± 0.0012 Å |
c | 16.7331 ± 0.0008 Å |
α | 90° |
β | 96.876 ± 0.002° |
γ | 90° |
Cell volume | 5528.5 ± 0.5 Å3 |
Cell temperature | 298 K |
Ambient diffraction temperature | 298 K |
Number of distinct elements | 5 |
Space group number | 14 |
Hermann-Mauguin space group symbol | P 1 21/n 1 |
Hall space group symbol | -P 2yn |
Residual factor for all reflections | 0.1425 |
Residual factor for significantly intense reflections | 0.0977 |
Weighted residual factors for significantly intense reflections | 0.2409 |
Weighted residual factors for all reflections included in the refinement | 0.2722 |
Goodness-of-fit parameter for all reflections included in the refinement | 1.018 |
Diffraction radiation wavelength | 1.54178 Å |
Diffraction radiation type | CuKα |