Information card for entry 4346655
Chemical name | NiCPB |
Formula | C48 H24 Ni2 O12 |
Calculated formula | C48 H24 Ni2 O12 |
Title of publication | Synthesis and Selective CO2 Capture Properties of a Series of Hexatopic Linker-Based Metal-Organic Frameworks. |
Authors of publication | Nguyen, Phuong T. K.; Nguyen, Huong T. D.; Pham, Hung Q.; Kim, Jaheon; Cordova, Kyle E.; Furukawa, Hiroyasu |
Journal of publication | Inorganic chemistry |
Year of publication | 2015 |
Journal volume | 54 |
Journal issue | 20 |
Pages of publication | 10065 - 10072 |
a | 16.2264 ± 0.0003 Å |
b | 29.4379 ± 0.0006 Å |
c | 12.4371 ± 0.0003 Å |
α | 90° |
β | 123.028 ± 0.001° |
γ | 90° |
Cell volume | 4980.83 ± 0.19 Å3 |
Cell temperature | 100 K |
Ambient diffraction temperature | 100 K |
Number of distinct elements | 4 |
Space group number | 15 |
Hermann-Mauguin space group symbol | C 1 2/c 1 |
Hall space group symbol | -C 2yc |
Residual factor for all reflections | 0.0784 |
Residual factor for significantly intense reflections | 0.055 |
Weighted residual factors for significantly intense reflections | 0.1363 |
Weighted residual factors for all reflections included in the refinement | 0.1464 |
Goodness-of-fit parameter for all reflections included in the refinement | 1.034 |
Diffraction radiation wavelength | 1.54178 Å |
Diffraction radiation type | CuKα |