Information card for entry 4346800
Formula | C47 H33 Cl3 Cu2 I2 N8 |
Calculated formula | C47 H33 Cl3 Cu2 I2 N8 |
Title of publication | Copper(I) Metal-Organic Framework: Visual Sensor for Detecting Small Polar Aliphatic Volatile Organic Compounds. |
Authors of publication | Yu, Yang; Ma, Jian-Ping; Zhao, Chao-Wei; Yang, Jing; Zhang, Xiao-Meng; Liu, Qi-Kui; Dong, Yu-Bin |
Journal of publication | Inorganic chemistry |
Year of publication | 2015 |
Journal volume | 54 |
Journal issue | 24 |
Pages of publication | 11590 - 11592 |
a | 26.191 ± 0.009 Å |
b | 10.653 ± 0.004 Å |
c | 18.419 ± 0.007 Å |
α | 90° |
β | 112.137 ± 0.005° |
γ | 90° |
Cell volume | 4760 ± 3 Å3 |
Cell temperature | 173 ± 2 K |
Ambient diffraction temperature | 173 ± 2 K |
Number of distinct elements | 6 |
Space group number | 15 |
Hermann-Mauguin space group symbol | C 1 2/c 1 |
Hall space group symbol | -C 2yc |
Residual factor for all reflections | 0.1131 |
Residual factor for significantly intense reflections | 0.0687 |
Weighted residual factors for significantly intense reflections | 0.1574 |
Weighted residual factors for all reflections included in the refinement | 0.1784 |
Goodness-of-fit parameter for all reflections included in the refinement | 1.058 |
Diffraction radiation wavelength | 0.71073 Å |
Diffraction radiation type | MoKα |