Information card for entry 4346801
Formula | C49 H38 Cu2 I2 N8 O |
Calculated formula | C49 H38 Cu2 I2 N8 O |
Title of publication | Copper(I) Metal-Organic Framework: Visual Sensor for Detecting Small Polar Aliphatic Volatile Organic Compounds. |
Authors of publication | Yu, Yang; Ma, Jian-Ping; Zhao, Chao-Wei; Yang, Jing; Zhang, Xiao-Meng; Liu, Qi-Kui; Dong, Yu-Bin |
Journal of publication | Inorganic chemistry |
Year of publication | 2015 |
Journal volume | 54 |
Journal issue | 24 |
Pages of publication | 11590 - 11592 |
a | 25.92 ± 0.004 Å |
b | 10.8349 ± 0.0017 Å |
c | 18.189 ± 0.003 Å |
α | 90° |
β | 111.262 ± 0.002° |
γ | 90° |
Cell volume | 4760.5 ± 1.3 Å3 |
Cell temperature | 173 ± 2 K |
Ambient diffraction temperature | 173 ± 2 K |
Number of distinct elements | 6 |
Space group number | 15 |
Hermann-Mauguin space group symbol | C 1 2/c 1 |
Hall space group symbol | -C 2yc |
Residual factor for all reflections | 0.0751 |
Residual factor for significantly intense reflections | 0.0516 |
Weighted residual factors for significantly intense reflections | 0.1224 |
Weighted residual factors for all reflections included in the refinement | 0.1336 |
Goodness-of-fit parameter for all reflections included in the refinement | 1.021 |
Diffraction radiation wavelength | 0.71073 Å |
Diffraction radiation type | MoKα |