Information card for entry 4346845
Formula | C27 H32 Cl2 N2 O8 Zn2 |
Calculated formula | C27 H32 Cl2 N2 O8 Zn2 |
Title of publication | Dinuclear Zinc Salen Catalysts for the Ring Opening Copolymerization of Epoxides and Carbon Dioxide or Anhydrides. |
Authors of publication | Thevenon, Arnaud; Garden, Jennifer A.; White, Andrew J. P.; Williams, Charlotte K. |
Journal of publication | Inorganic chemistry |
Year of publication | 2015 |
Journal volume | 54 |
Journal issue | 24 |
Pages of publication | 11906 - 11915 |
a | 8.2671 ± 0.0003 Å |
b | 12.7351 ± 0.0008 Å |
c | 14.198 ± 0.0006 Å |
α | 89.017 ± 0.004° |
β | 87.86 ± 0.003° |
γ | 79.825 ± 0.004° |
Cell volume | 1470.18 ± 0.12 Å3 |
Cell temperature | 173 K |
Ambient diffraction temperature | 173 K |
Number of distinct elements | 6 |
Space group number | 2 |
Hermann-Mauguin space group symbol | P -1 |
Hall space group symbol | -P 1 |
Residual factor for all reflections | 0.0516 |
Residual factor for significantly intense reflections | 0.0379 |
Weighted residual factors for significantly intense reflections | 0.0837 |
Weighted residual factors for all reflections included in the refinement | 0.0905 |
Goodness-of-fit parameter for all reflections included in the refinement | 1.026 |
Diffraction radiation wavelength | 0.71073 Å |
Diffraction radiation type | MoKα |