Information card for entry 4346846
Formula | C66 H104 N4 O14 Zn2 |
Calculated formula | C66 H104 N4 O14 Zn2 |
Title of publication | Dinuclear Zinc Salen Catalysts for the Ring Opening Copolymerization of Epoxides and Carbon Dioxide or Anhydrides. |
Authors of publication | Thevenon, Arnaud; Garden, Jennifer A.; White, Andrew J. P.; Williams, Charlotte K. |
Journal of publication | Inorganic chemistry |
Year of publication | 2015 |
Journal volume | 54 |
Journal issue | 24 |
Pages of publication | 11906 - 11915 |
a | 11.0206 ± 0.0004 Å |
b | 12.7927 ± 0.0005 Å |
c | 13.4261 ± 0.0006 Å |
α | 108.871 ± 0.004° |
β | 108.312 ± 0.004° |
γ | 92.889 ± 0.003° |
Cell volume | 1675.88 ± 0.14 Å3 |
Cell temperature | 173 K |
Ambient diffraction temperature | 173 K |
Number of distinct elements | 5 |
Space group number | 2 |
Hermann-Mauguin space group symbol | P -1 |
Hall space group symbol | -P 1 |
Residual factor for all reflections | 0.061 |
Residual factor for significantly intense reflections | 0.0462 |
Weighted residual factors for significantly intense reflections | 0.1055 |
Weighted residual factors for all reflections included in the refinement | 0.1149 |
Goodness-of-fit parameter for all reflections included in the refinement | 1.033 |
Diffraction radiation wavelength | 0.71073 Å |
Diffraction radiation type | MoKα |