Information card for entry 4346951
Formula | C38 H27 B2 Co F8 N7 |
Calculated formula | C38 H27 B2 Co F8 N7 |
Title of publication | Molecular and Electronic Structures of Homoleptic Six-Coordinate Cobalt(I) Complexes of 2,2':6',2″-Terpyridine, 2,2'-Bipyridine, and 1,10-Phenanthroline. An Experimental and Computational Study. |
Authors of publication | England, Jason; Bill, Eckhard; Weyhermüller, Thomas; Neese, Frank; Atanasov, Mihail; Wieghardt, Karl |
Journal of publication | Inorganic chemistry |
Year of publication | 2015 |
Journal volume | 54 |
Journal issue | 24 |
Pages of publication | 12002 - 12018 |
a | 18.05 ± 0.0014 Å |
b | 9.3514 ± 0.0005 Å |
c | 22.009 ± 0.002 Å |
α | 90° |
β | 107.337 ± 0.007° |
γ | 90° |
Cell volume | 3546.2 ± 0.5 Å3 |
Cell temperature | 100 ± 2 K |
Ambient diffraction temperature | 100 ± 2 K |
Number of distinct elements | 6 |
Space group number | 14 |
Hermann-Mauguin space group symbol | P 1 21/n 1 |
Hall space group symbol | -P 2yn |
Residual factor for all reflections | 0.061 |
Residual factor for significantly intense reflections | 0.0508 |
Weighted residual factors for significantly intense reflections | 0.1217 |
Weighted residual factors for all reflections included in the refinement | 0.1277 |
Goodness-of-fit parameter for all reflections included in the refinement | 1.18 |
Diffraction radiation wavelength | 0.71073 Å |
Diffraction radiation type | MoKα |