Information card for entry 4346952
Formula | C43 H34.5 B Co F4 N9.5 |
Calculated formula | C43 H34.5003 B Co F4 N9.5 |
Title of publication | Molecular and Electronic Structures of Homoleptic Six-Coordinate Cobalt(I) Complexes of 2,2':6',2″-Terpyridine, 2,2'-Bipyridine, and 1,10-Phenanthroline. An Experimental and Computational Study. |
Authors of publication | England, Jason; Bill, Eckhard; Weyhermüller, Thomas; Neese, Frank; Atanasov, Mihail; Wieghardt, Karl |
Journal of publication | Inorganic chemistry |
Year of publication | 2015 |
Journal volume | 54 |
Journal issue | 24 |
Pages of publication | 12002 - 12018 |
a | 14.2287 ± 0.0011 Å |
b | 14.2287 ± 0.0011 Å |
c | 34.0196 ± 0.0013 Å |
α | 90° |
β | 90° |
γ | 120° |
Cell volume | 5964.7 ± 0.7 Å3 |
Cell temperature | 100 ± 2 K |
Ambient diffraction temperature | 100 ± 2 K |
Number of distinct elements | 6 |
Space group number | 148 |
Hermann-Mauguin space group symbol | R -3 :H |
Hall space group symbol | -R 3 |
Residual factor for all reflections | 0.0406 |
Residual factor for significantly intense reflections | 0.0364 |
Weighted residual factors for significantly intense reflections | 0.0971 |
Weighted residual factors for all reflections included in the refinement | 0.1002 |
Goodness-of-fit parameter for all reflections included in the refinement | 1.083 |
Diffraction radiation wavelength | 0.71073 Å |
Diffraction radiation type | MoKα |