Information card for entry 4349674
Formula | C158 H124 Lu4 N16 O16 S6 |
Calculated formula | C158 H124 Lu4 N16 O16 S6 |
Title of publication | Fine-tuning the magnetocaloric effect and SMMs behaviors of coplanar RE4 complexes by β-diketonate coligands |
Authors of publication | Gao, Hong-Ling; Wang, Ni-Ni; Wang, Wen-Min; Shen, Hai-Yun; Zhou, Xiao-Pu; Chang, Yi-Xin; Zhang, Ru-Xia; Cui, Jian-Zhong |
Journal of publication | Inorganic Chemistry Frontiers |
Year of publication | 2017 |
Journal volume | 4 |
Journal issue | 5 |
Pages of publication | 860 |
a | 15.1083 ± 0.0007 Å |
b | 16.1672 ± 0.0008 Å |
c | 16.4663 ± 0.0007 Å |
α | 77.796 ± 0.005° |
β | 70.784 ± 0.004° |
γ | 76.826 ± 0.005° |
Cell volume | 3657.1 ± 0.3 Å3 |
Cell temperature | 113 ± 2 K |
Ambient diffraction temperature | 113 ± 2 K |
Number of distinct elements | 6 |
Space group number | 2 |
Hermann-Mauguin space group symbol | P -1 |
Hall space group symbol | -P 1 |
Residual factor for all reflections | 0.0305 |
Residual factor for significantly intense reflections | 0.0259 |
Weighted residual factors for significantly intense reflections | 0.0683 |
Weighted residual factors for all reflections included in the refinement | 0.07 |
Goodness-of-fit parameter for all reflections included in the refinement | 1.04 |
Diffraction radiation wavelength | 0.71073 Å |
Diffraction radiation type | MoKα |