Information card for entry 4349675
Formula | C117 H100 N15.5 O16 S6 Tb4 |
Calculated formula | C116.944 H90 N15.472 O16 S6 Tb4 |
Title of publication | Fine-tuning the magnetocaloric effect and SMMs behaviors of coplanar RE4 complexes by β-diketonate coligands |
Authors of publication | Gao, Hong-Ling; Wang, Ni-Ni; Wang, Wen-Min; Shen, Hai-Yun; Zhou, Xiao-Pu; Chang, Yi-Xin; Zhang, Ru-Xia; Cui, Jian-Zhong |
Journal of publication | Inorganic Chemistry Frontiers |
Year of publication | 2017 |
Journal volume | 4 |
Journal issue | 5 |
Pages of publication | 860 |
a | 12.5319 ± 0.0007 Å |
b | 14.8876 ± 0.0007 Å |
c | 31.5246 ± 0.0017 Å |
α | 90° |
β | 98.372 ± 0.001° |
γ | 90° |
Cell volume | 5818.9 ± 0.5 Å3 |
Cell temperature | 113 ± 2 K |
Ambient diffraction temperature | 113 ± 2 K |
Number of distinct elements | 6 |
Space group number | 14 |
Hermann-Mauguin space group symbol | P 1 21/c 1 |
Hall space group symbol | -P 2ybc |
Residual factor for all reflections | 0.0367 |
Residual factor for significantly intense reflections | 0.0315 |
Weighted residual factors for significantly intense reflections | 0.0825 |
Weighted residual factors for all reflections included in the refinement | 0.0861 |
Goodness-of-fit parameter for all reflections included in the refinement | 1.037 |
Diffraction radiation wavelength | 0.71073 Å |
Diffraction radiation type | MoKα |