Information card for entry 4349703
Formula | C14 H8 Au Fe N7 |
Calculated formula | C14 H8 Au Fe N7 |
Title of publication | A ladder-type iron(ii) coordination polymer with enhanced spin-crossover behavior |
Authors of publication | Yan, Zheng; Zhu, Long-Feng; Zhu, Lian-Wen; Meng, Yan; Hoque, Md. Najbul; Liu, Jun-Liang; Chen, Yan-Cong; Ni, Zhao-Ping; Tong, Ming-Liang |
Journal of publication | Inorganic Chemistry Frontiers |
Year of publication | 2017 |
Journal volume | 4 |
Journal issue | 6 |
Pages of publication | 921 |
a | 11.5618 ± 0.0011 Å |
b | 15.3114 ± 0.0018 Å |
c | 10.1474 ± 0.0014 Å |
α | 90° |
β | 124.673 ± 0.003° |
γ | 90° |
Cell volume | 1477.4 ± 0.3 Å3 |
Cell temperature | 298 ± 2 K |
Ambient diffraction temperature | 298.15 K |
Number of distinct elements | 5 |
Space group number | 12 |
Hermann-Mauguin space group symbol | C 1 2/m 1 |
Hall space group symbol | -C 2y |
Residual factor for all reflections | 0.0553 |
Residual factor for significantly intense reflections | 0.0475 |
Weighted residual factors for significantly intense reflections | 0.1173 |
Weighted residual factors for all reflections included in the refinement | 0.1197 |
Goodness-of-fit parameter for all reflections included in the refinement | 0.9903 |
Diffraction radiation wavelength | 0.71073 Å |
Diffraction radiation type | MoKα |